{"text_format":"1","workbook":"xlsx","n_sheets":7,"sheets":["intake","Travel Reimbursement","Per Diem Multiple Destinations","Mileage Log","Business Meal Details","Meals With No Overnight","RLT"],"not_rendered":{"charts":0,"images":0,"macros":1,"external_links":0,"defined_names":11,"comments":3,"pivot_tables":0},"unopened":[],"bounds":{"document_bytes":16777216,"sheet_cells":100000,"rows_first":2000,"rows_last":500,"rows_between":2000,"halvings":0,"cell_chars":16384,"cell_head_chars":4096},"cells_cut":0,"cells_raw":0,"read":"whole","date_system":"1900"}

{"sheet":"intake","index":0,"n_rows":44,"n_cols":6,"rows_kept":44,"cut":false,"hidden":true,"merged":[[31,1,31,2],[35,4,35,5],[0,4,0,5],[0,1,0,2],[18,1,18,2],[18,4,18,5],[23,1,23,2],[23,4,23,5]]}
[null,"Duty Station DropDown",null,null,"Affiliation Dropdown"]
[null,1,"SELECT DUTY STATION",null,1,"SELECT AFFILIATION"]
[null,2,"STORRS",null,2,"Faculty"]
[null,3,"HEALTH CENTER",null,3,"Staff - UCPEA/AAUP"]
[null,4,"AVERY POINT",null,4,"Staff - MANAGERIAL"]
[null,5,"GREATER HARTFORD",null,5,"Staff - P2"]
[" ",6,"STAMFORD",null,6,"Staff - NP-5"]
[null,7,"TORRINGTON",null,7,"Staff - NP-3"]
[null,8,"WATERBURY",null,8,"Staff - NP-2"]
[null,9,"LAW",null,9,"Student"]
[null,10,"SOCIAL WORK",null,10,"Volunteer"]
[null,11,"GBLC",null,11,"Other"]
[null,12,{"$f":"'Travel Reimbursement'!L3","v":"OTHER - Type In Next Box"}]
[]
[]
{"$rows_left_out":30}
{"sheet":"Travel Reimbursement","index":1,"n_rows":57,"n_cols":24,"rows_kept":57,"cut":false,"hidden":false,"merged":[[54,0,54,11],[56,0,56,1],[55,0,55,1],[56,2,56,5],[55,2,55,6],[56,7,56,9],[1,17,1,18],[2,17,2,18],[33,1,33,2],[45,13,46,15],[28,5,28,6],[27,5,27,6],[26,5,26,6],[25,5,25,6],[25,8,25,9],[26,8,26,9],[27,8,27,9],[28,8,28,9],[29,8,29,9],[36,5,36,6],[37,5,37,6],[38,5,38,6],[39,5,39,6],[45,0,45,10],[51,0,51,1],[50,6,50,11],[0,7,0,9],[20,1,20,2],[18,1,18,2],[19,1,19,2],[4,1,4,4],[0,1,0,4],[1,1,1,4],[2,1,2,4],[3,1,3,4],[1,5,1,6],[2,5,2,6],[0,5,0,6],[3,7,3,9],[7,7,7,8],[7,1,7,2],[7,3,7,4],[7,5,7,6],[20,3,20,4],[19,8,19,9],[20,8,20,9],[19,5,19,6],[20,5,20,6],[51,3,51,4],[52,3,52,4],[53,3,53,4],[21,5,21,6],[22,5,22,6],[23,5,23,6],[24,5,24,6],[31,5,31,6],[32,5,32,6],[33,5,33,6],[34,5,34,6],[35,5,35,6],[26,3,26,4],[27,3,27,4],[22,3,22,4],[23,3,23,4],[24,3,24,4],[51,6,53,11],[22,8,22,9],[23,8,23,9],[24,8,24,9],[1,13,1,15],[1,7,1,9],[2,7,2,9],[4,7,4,9],[3,5,3,6],[1,12,19,12],[8,1,8,2],[8,3,8,4],[8,5,8,6],[8,7,8,8],[8,9,8,10],[10,3,10,4],[10,5,10,6],[10,7,10,8],[10,9,10,10],[16,5,16,7],[5,0,5,11],[1,10,1,11],[14,1,14,2],[7,9,7,10],[14,3,14,4],[11,3,11,4],[18,3,18,4],[19,3,19,4],[6,16,6,22],[16,1,16,4],[16,11,17,11],[17,8,17,9],[17,5,17,6],[17,3,17,4],[17,1,17,2],[10,1,10,2],[14,9,14,10],[13,1,13,2],[13,3,13,4],[13,5,13,6],[13,7,13,8],[13,9,13,10],[11,1,11,2],[12,7,12,8],[12,5,12,6],[12,3,12,4],[12,1,12,2],[16,8,16,10],[11,7,11,8],[14,7,14,8],[11,9,11,10],[20,13,24,15],[18,8,18,9],[18,5,18,6],[21,1,21,2],[6,3,6,4],[23,1,23,2],[24,1,24,2],[21,3,21,4],[15,1,15,2],[15,3,15,4],[15,5,15,6],[15,7,15,8],[15,9,15,10],[6,9,6,10],[9,1,9,2],[9,3,9,4],[9,5,9,6],[9,7,9,8],[9,9,9,10],[12,9,12,10],[11,5,11,6],[14,5,14,6],[22,1,22,2],[21,8,21,9],[52,0,52,1],[53,0,53,1],[37,3,37,4],[38,3,38,4],[39,3,39,4],[40,3,40,4],[47,0,47,10],[41,0,41,10],[38,1,38,2],[39,1,39,2],[43,0,43,2],[40,1,40,2],[42,3,42,4],[42,1,42,2],[42,8,42,9],[42,5,42,6],[37,1,37,2],[44,0,44,10],[40,5,40,6],[51,5,53,5],[50,0,50,1],[46,0,46,10],[49,0,49,10],[50,3,50,4],[32,13,38,15],[48,0,48,10],[48,13,48,15],[35,8,35,9],[36,8,36,9],[37,8,37,9],[38,8,38,9],[39,8,39,9],[40,13,41,15],[40,7,40,9],[32,1,32,2],[32,8,32,9],[34,8,34,9],[35,1,35,2],[36,1,36,2],[34,3,34,4],[35,3,35,4],[36,3,36,4],[34,1,34,2],[31,1,31,2],[33,8,33,9],[30,8,30,9],[25,1,25,2],[28,1,28,2],[29,1,29,2],[30,1,30,2],[25,3,25,4],[28,3,28,4],[30,5,30,6],[29,5,29,6],[29,3,29,4],[30,3,30,4],[32,3,32,4],[33,3,33,4],[31,8,31,9],[31,3,31,4],[26,1,26,2],[27,1,27,2]]}
["Traveler's Name:",null,null,null,null,"Department:",null,null,null,null,"U-Box:"]
["University Affiliation:",1,null,null,null,"Travel Approval Number:",null,null,null,null,null,null,null,false,null,null,null,"M&IE Foreign Rate",null,"Breakfast","Lunch","Dinner","IE"]
["Location of Travel:",null,null,null,null,"Official Duty Station:",null,1,null,null,"Other duty:","OTHER - Type In Next Box",null,{"$f":"intake!#REF!","v":{"$error":"#REF!"}},{"$f":"intake!#REF!","v":{"$error":"#REF!"}},{"$f":"$D$7","v":8},null,{"$f":"$H$7","v":0},null,{"$f":"IF($R$3=0, 0, VLOOKUP($R$3,RLT!$A$26:$E$294,2))","v":0},{"$f":"IF($R$3=0, 0, VLOOKUP($R$3,RLT!$A$26:$E$294,3))","v":0},{"$f":"IF($R$3=0, 0, VLOOKUP($R$3,RLT!$A$26:$E$294,4))","v":0},{"$f":"IF($R$3=0, 0, VLOOKUP($R$3,RLT!$A$26:$E$294,5))","v":0}]
["Departure Date:",null,null,null,null,"Return Date:",null,null,null,null,null,"VERSION 3.3",null,{"$f":"$D$7","v":8}]
["Departure Time:",null,null,null,null,1,"Return Time:",null,null,null,1,null,null,{"$f":"'Mileage Log'!$F$4","v":0},{"$f":"RLT!A16","v":0.57499999999999996},{"$f":"IF(B2=10,(N5*0.14),IF($N$2 = FALSE, SUM(N5*O5), N5*0.194 ))","v":0}]
["Per Diem Meals Section (Single Destination Trip)  - Select any meals PROVIDED TO the Traveler in the corresponding day"]
[null,null,"Select Rate:",8,null,null,"Foreign/Other Rate:",null,null,"Per Diem Calculated:",null,{"$f":"SUM(X18:X23,'Per Diem Multiple Destinations'!G3)","v":0},null,null,null,null,"Per Diem Formulas Below"]
[{"$f":"IF($D$7=1,\"\",$B$4)","v":"00:00:00"},{"$f":"IF(A8=\"\",\"\",(IF(A8+1<=$H$4,A8+1,\"\")))","v":""},null,{"$f":"IF(B8=\"\",\"\",(IF(B8+1<=$H$4,B8+1,\"\")))","v":""},null,{"$f":"IF(D8=\"\",\"\",(IF(D8+1<=$H$4,D8+1,\"\")))","v":""},null,{"$f":"IF(F8=\"\",\"\",(IF(F8+1<=$H$4,F8+1,\"\")))","v":""},null,{"$f":"IF(H8=\"\",\"\",(IF(H8+1<=$H$4,H8+1,\"\")))","v":""},null,{"$f":"IF(J8=\"\",\"\",(IF(J8+1<=$H$4,J8+1,\"\")))","v":""}]
[1,1,null,1,null,1,null,1,null,1,null,1,null,null,null,null,{"$f":"IF(VLOOKUP(A9,RLT!$I$3:$Q$14,$D7+1)=\"None\", 0, IF(A8=\"\",0, VLOOKUP(A9,RLT!$I$3:$Q$14,$D7+1)))","v":0},{"$f":"IF(VLOOKUP(B9,RLT!$I$3:$Q$14,$D7+1)=\"None\", 0, IF(B8=\"\",0, VLOOKUP(B9,RLT!$I$3:$Q$14,$D7+1)))","v":0},{"$f":"IF(VLOOKUP(D9,RLT!$I$3:$Q$14,$D7+1)=\"None\", 0, IF(D8=\"\",0, VLOOKUP(D9,RLT!$I$3:$Q$14,$D7+1)))","v":0},{"$f":"IF(VLOOKUP(F9,RLT!$I$3:$Q$14,$D7+1)=\"None\", 0, IF(F8=\"\",0, VLOOKUP(F9,RLT!$I$3:$Q$14,$D7+1)))","v":0},{"$f":"IF(VLOOKUP(H9,RLT!$I$3:$Q$14,$D7+1)=\"None\", 0, IF(H8=\"\",0, VLOOKUP(H9,RLT!$I$3:$Q$14,$D7+1)))","v":0},{"$f":"IF(VLOOKUP(J9,RLT!$I$3:$Q$14,$D7+1)=\"None\", 0, IF(J8=\"\",0, VLOOKUP(J9,RLT!$I$3:$Q$14,$D7+1)))","v":0},{"$f":"IF(VLOOKUP(L9,RLT!$I$3:$Q$14,$D7+1)=\"None\", 0, IF(L8=\"\",0, VLOOKUP(L9,RLT!$I$3:$Q$14,$D7+1)))","v":0}]
[{"$f":"SUM(Q18:Q19)","v":0},{"$f":"SUM(R18:R19)","v":0},null,{"$f":"SUM(S18:S19)","v":0},null,{"$f":"SUM(T18:T19)","v":0},null,{"$f":"SUM(U18:U19)","v":0},null,{"$f":"SUM(V18:V19)","v":0},null,{"$f":"SUM(W18:W19)","v":0}]
[{"$f":"IF(L8=\"\",\"\",(IF(L8+1<=$H$4,L8+1,\"\")))","v":""},{"$f":"IF(A11=\"\",\"\",(IF(A11+1<=$H$4,A11+1,\"\")))","v":""},null,{"$f":"IF(B11=\"\",\"\",(IF(B11+1<=$H$4,B11+1,\"\")))","v":""},null,{"$f":"IF(D11=\"\",\"\",(IF(D11+1<=$H$4,D11+1,\"\")))","v":""},null,{"$f":"IF(F11=\"\",\"\",(IF(F11+1<=$H$4,F11+1,\"\")))","v":""},null,{"$f":"IF(H11=\"\",\"\",(IF(H11+1<=$H$4,H11+1,\"\")))","v":""},null,{"$f":"IF(J11=\"\",\"\",(IF(J11+1<=$H$4,J11+1,\"\")))","v":""}]
[1,1,null,1,null,1,null,1,null,1,null,1,null,null,null,null,{"$f":"IF(VLOOKUP(A12,RLT!$I$3:$Q$14,$D7+1)=\"None\", 0, IF(A11=\"\",0, VLOOKUP(A12,RLT!$I$3:$Q$14,$D7+1)))","v":0},{"$f":"IF(VLOOKUP(B12,RLT!$I$3:$Q$14,$D7+1)=\"None\", 0, IF(B11=\"\",0, VLOOKUP(B12,RLT!$I$3:$Q$14,$D7+1)))","v":0},{"$f":"IF(VLOOKUP(D12,RLT!$I$3:$Q$14,$D7+1)=\"None\", 0, IF(D11=\"\",0, VLOOKUP(D12,RLT!$I$3:$Q$14,$D7+1)))","v":0},{"$f":"IF(VLOOKUP(F12,RLT!$I$3:$Q$14,$D7+1)=\"None\", 0, IF(F11=\"\",0, VLOOKUP(F12,RLT!$I$3:$Q$14,$D7+1)))","v":0},{"$f":"IF(VLOOKUP(H12,RLT!$I$3:$Q$14,$D7+1)=\"None\", 0, IF(H11=\"\",0, VLOOKUP(H12,RLT!$I$3:$Q$14,$D7+1)))","v":0},{"$f":"IF(VLOOKUP(J12,RLT!$I$3:$Q$14,$D7+1)=\"None\", 0, IF(J11=\"\",0, VLOOKUP(J12,RLT!$I$3:$Q$14,$D7+1)))","v":0},{"$f":"IF(VLOOKUP(L12,RLT!$I$3:$Q$14,$D7+1)=\"None\", 0, IF(L11=\"\",0, VLOOKUP(L12,RLT!$I$3:$Q$14,$D7+1)))","v":0}]
[{"$f":"SUM(Q20:Q21)","v":0},{"$f":"SUM(R20:R21)","v":0},null,{"$f":"SUM(S20:S21)","v":0},null,{"$f":"SUM(T20:T21)","v":0},null,{"$f":"SUM(U20:U21)","v":0},null,{"$f":"SUM(V20:V21)","v":0},null,{"$f":"SUM(W20:W21)","v":0}]
[{"$f":"IF(L11=\"\",\"\",(IF(L11+1<=$H$4,L11+1,\"\")))","v":""},{"$f":"IF(A14=\"\",\"\",(IF(A14+1<=$H$4,A14+1,\"\")))","v":""},null,{"$f":"IF(B14=\"\",\"\",(IF(B14+1<=$H$4,B14+1,\"\")))","v":""},null,{"$f":"IF(D14=\"\",\"\",(IF(D14+1<=$H$4,D14+1,\"\")))","v":""},null,{"$f":"IF(F14=\"\",\"\",(IF(F14+1<=$H$4,F14+1,\"\")))","v":""},null,{"$f":"IF(H14=\"\",\"\",(IF(H14+1<=$H$4,H14+1,\"\")))","v":""},null,{"$f":"IF(J14=\"\",\"\",(IF(J14+1<=$H$4,J14+1,\"\")))","v":""}]
[1,1,null,1,null,1,null,1,null,1,null,1,null,null,null,null,{"$f":"IF(VLOOKUP(A15,RLT!$I$3:$Q$14,$D7+1)=\"None\", 0, IF(A14=\"\",0, VLOOKUP(A15,RLT!$I$3:$Q$14,$D7+1)))","v":0},{"$f":"IF(VLOOKUP(B15,RLT!$I$3:$Q$14,$D7+1)=\"None\", 0, IF(B14=\"\",0, VLOOKUP(B15,RLT!$I$3:$Q$14,$D7+1)))","v":0},{"$f":"IF(VLOOKUP(D15,RLT!$I$3:$Q$14,$D7+1)=\"None\", 0, IF(D14=\"\",0, VLOOKUP(D15,RLT!$I$3:$Q$14,$D7+1)))","v":0},{"$f":"IF(VLOOKUP(F15,RLT!$I$3:$Q$14,$D7+1)=\"None\", 0, IF(F14=\"\",0, VLOOKUP(F15,RLT!$I$3:$Q$14,$D7+1)))","v":0},{"$f":"IF(VLOOKUP(H15,RLT!$I$3:$Q$14,$D7+1)=\"None\", 0, IF(H14=\"\",0, VLOOKUP(H15,RLT!$I$3:$Q$14,$D7+1)))","v":0},{"$f":"IF(VLOOKUP(J15,RLT!$I$3:$Q$14,$D7+1)=\"None\", 0, IF(J14=\"\",0, VLOOKUP(J15,RLT!$I$3:$Q$14,$D7+1)))","v":0},{"$f":"IF(VLOOKUP(L15,RLT!$I$3:$Q$14,$D7+1)=\"None\", 0, IF(L14=\"\",0, VLOOKUP(L15,RLT!$I$3:$Q$14,$D7+1)))","v":0}]
{"$rows_left_out":43}
{"sheet":"Per Diem Multiple Destinations","index":2,"n_rows":51,"n_cols":23,"rows_kept":51,"cut":false,"hidden":false,"merged":[[11,0,11,6],[48,17,48,18],[39,0,39,1],[39,3,39,4],[40,17,40,18],[41,17,41,18],[44,0,44,1],[44,3,44,4],[43,0,43,6],[36,0,36,1],[36,3,36,4],[37,3,37,4],[37,5,37,6],[38,3,38,4],[30,3,30,4],[31,0,31,1],[49,17,49,18],[45,3,45,4],[45,5,45,6],[46,3,46,4],[47,0,47,1],[47,3,47,4],[31,3,31,4],[32,17,32,18],[33,17,33,18],[35,0,35,6],[24,17,24,18],[25,17,25,18],[28,0,28,1],[28,3,28,4],[29,3,29,4],[29,5,29,6],[27,0,27,6],[21,3,21,4],[21,5,21,6],[22,3,22,4],[23,0,23,1],[23,3,23,4],[15,0,15,1],[15,3,15,4],[16,17,16,18],[17,17,17,18],[20,0,20,1],[20,3,20,4],[19,0,19,6],[12,0,12,1],[12,3,12,4],[13,3,13,4],[13,5,13,6],[14,3,14,4],[8,17,8,18],[9,17,9,18],[7,0,7,1],[6,3,6,4],[7,3,7,4],[0,0,0,6],[1,1,1,2],[2,1,2,2],[3,0,3,6],[5,5,5,6],[4,3,4,4],[4,0,4,1],[5,3,5,4]]}
["Multiple Destination - Per Diem Page"]
["Traveler:",{"$f":"IF('Travel Reimbursement'!B1=\"\",\"\",'Travel Reimbursement'!B1)","v":""},null,"Department:",{"$f":"IF('Travel Reimbursement'!H1=\"\",\"\",'Travel Reimbursement'!H1)","v":""},"U-box:",{"$f":"IF('Travel Reimbursement'!L1=\"\",\"\",'Travel Reimbursement'!L1)","v":""}]
["Affiliation:",{"$f":"VLOOKUP('Travel Reimbursement'!$B$2,intake!E2:F11,2)","v":"SELECT AFFILIATION"},null,"TA Number:",{"$f":"IF('Travel Reimbursement'!H2=\"\",\"\",'Travel Reimbursement'!H2)","v":""},"Subtotal:",{"$f":"SUM(G5,G13,G21, G29,G37,G45)","v":0}]
[]
["Per Diem #1",null,"Location:","here",null,"Location 1 Total",{"$f":"SUM(A11:G11)","v":0}]
["Select Rates:",1,null,"Date",null,"Time"]
["Foreign Rates:",null,"Depart:",{"$f":"IF('Travel Reimbursement'!B4=\"\",\"\",'Travel Reimbursement'!B4)","v":""},null,{"$f":"IF('Travel Reimbursement'!B5=\"\",\"\",'Travel Reimbursement'!B5)","v":""},{"$f":"IF('Travel Reimbursement'!F5=\"\",\"1\",'Travel Reimbursement'!F5)","v":1}]
[null,null,"Return:",null,null,null,2,null,{"$f":"IF(B6=8,2,1)","v":1},{"$f":"IF(B6=8,1,0)","v":0}]
[{"$f":"IF(D7 =\"\", \"\", D7)","v":""},{"$f":"IF(A9=\"\",\"\",(IF(A9+1<=$D$8,A9+1,\"\")))","v":""},"","","","","",null,{"$f":"IF(VLOOKUP(A10,RLT!$I$3:$X$14,$B$6+$I8)=\"None\",0,IF(A9=\"\",0,VLOOKUP(A10,RLT!$I$3:$X$14,$B$6+$I8)))","v":0},{"$f":"IF(VLOOKUP(B10,RLT!$I$3:$X$14,$B$6+$I8)=\"None\",0,IF(B9=\"\",0,VLOOKUP(B10,RLT!$I$3:$X$14,$B$6+$I8)))","v":0},{"$f":"IF(VLOOKUP(C10,RLT!$I$3:$X$14,$B$6+$I8)=\"None\",0,IF(C9=\"\",0,VLOOKUP(C10,RLT!$I$3:$X$14,$B$6+$I8)))","v":0},{"$f":"IF(VLOOKUP(D10,RLT!$I$3:$X$14,$B$6+$I8)=\"None\",0,IF(D9=\"\",0,VLOOKUP(D10,RLT!$I$3:$X$14,$B$6+$I8)))","v":0},{"$f":"IF(VLOOKUP(E10,RLT!$I$3:$X$14,$B$6+$I8)=\"None\",0,IF(E9=\"\",0,VLOOKUP(E10,RLT!$I$3:$X$14,$B$6+$I8)))","v":0},{"$f":"IF(VLOOKUP(F10,RLT!$I$3:$X$14,$B$6+$I8)=\"None\",0,IF(F9=\"\",0,VLOOKUP(F10,RLT!$I$3:$X$14,$B$6+$I8)))","v":0},{"$f":"IF(VLOOKUP(G10,RLT!$I$3:$X$14,$B$6+$I8)=\"None\",0,IF(G9=\"\",0,VLOOKUP(G10,RLT!$I$3:$X$14,$B$6+$I8)))","v":0},null,null,"M&IE Foreign Rate",null,"Breakfast","Lunch","Dinner","IE"]
[1,1,1,1,1,1,1,null,{"$f":"IF(I9=0, 0, IF($D7=\"\",0, IF(AND($F7<0.29166,$G7=1),I9,IF(AND($F7<0.45833,$G7=1),I9-HLOOKUP($B6+$J8,RLT!$J$1:$X$10,9),IF(AND($F7>=0.5,$F7<=0.541,$G7=1),I9,IF($G7=1,I9-HLOOKUP($B6+$J8,RLT!$J$1:$X$10,6),IF(AND($F7>=0.5,$F7<=0.541,$G7=2),I9-HLOOKUP($B6+$J8,RLT!$J$1:$X$10,6),IF(AND($F7<0.20833,$G7=2),I9-HLOOKUP($B6+$J8,RLT!$J$1:$X$10,6),0))))))))","v":0},{"$f":"IF(J9=0, 0,IF(C9=\"\",IF(OR(AND($F8<=0.541,$G8=1,$F8>=0.5), AND($F8<=0.375,$G8=1)),0, IF($G8=1,J9-HLOOKUP($B6+$J8,RLT!$J$1:$X$10,4), IF(AND($F8<=0.0833,$G8=2), J9-HLOOKUP($B6+$J8,RLT!$J$1:$X$10,4), IF(AND($F8<=0.2916,$G8=2),J9-HLOOKUP($B6+$J8,RLT!$J$1:$X$10,7),IF(AND($F8<=0.541,$F8>=0.5,$G8=2),J9-HLOOKUP($B6+$J8,RLT!$J$1:$X$10,4), J9)))) ),J9))","v":0},{"$f":"IF(K9=0, 0,IF(D9=\"\",IF(OR(AND($F8<=0.541,$G8=1,$F8>=0.5), AND($F8<=0.375,$G8=1)),0, IF($G8=1,K9-HLOOKUP($B6+$J8,RLT!$J$1:$X$10,4), IF(AND($F8<=0.0833,$G8=2), K9-HLOOKUP($B6+$J8,RLT!$J$1:$X$10,4), IF(AND($F8<=0.2916,$G8=2),K9-HLOOKUP($B6+$J8,RLT!$J$1:$X$10,7),IF(AND($F8<=0.541,$F8>=0.5,$G8=2),K9-HLOOKUP($B6+$J8,RLT!$J$1:$X$10,4), K9)))) ),K9))","v":0},{"$f":"IF(L9=0, 0,IF(E9=\"\",IF(OR(AND($F8<=0.541,$G8=1,$F8>=0.5), AND($F8<=0.375,$G8=1)),0, IF($G8=1,L9-HLOOKUP($B6+$J8,RLT!$J$1:$X$10,4), IF(AND($F8<=0.0833,$G8=2), L9-HLOOKUP($B6+$J8,RLT!$J$1:$X$10,4), IF(AND($F8<=0.2916,$G8=2),L9-HLOOKUP($B6+$J8,RLT!$J$1:$X$10,7),IF(AND($F8<=0.541,$F8>=0.5,$G8=2),L9-HLOOKUP($B6+$J8,RLT!$J$1:$X$10,4), L9)))) ),L9))","v":0},{"$f":"IF(M9=0, 0,IF(F9=\"\",IF(OR(AND($F8<=0.541,$G8=1,$F8>=0.5), AND($F8<=0.375,$G8=1)),0, IF($G8=1,M9-HLOOKUP($B6+$J8,RLT!$J$1:$X$10,4), IF(AND($F8<=0.0833,$G8=2), M9-HLOOKUP($B6+$J8,RLT!$J$1:$X$10,4), IF(AND($F8<=0.2916,$G8=2),M9-HLOOKUP($B6+$J8,RLT!$J$1:$X$10,7),IF(AND($F8<=0.541,$F8>=0.5,$G8=2),M9-HLOOKUP($B6+$J8,RLT!$J$1:$X$10,4), M9)))) ),M9))","v":0},{"$f":"IF(N9=0, 0,IF(G9=\"\",IF(OR(AND($F8<=0.541,$G8=1,$F8>=0.5), AND($F8<=0.375,$G8=1)),0, IF($G8=1,N9-HLOOKUP($B6+$J8,RLT!$J$1:$X$10,4), IF(AND($F8<=0.0833,$G8=2), N9-HLOOKUP($B6+$J8,RLT!$J$1:$X$10,4), IF(AND($F8<=0.2916,$G8=2),N9-HLOOKUP($B6+$J8,RLT!$J$1:$X$10,7),IF(AND($F8<=0.541,$F8>=0.5,$G8=2),N9-HLOOKUP($B6+$J8,RLT!$J$1:$X$10,4), N9)))) ),N9))","v":0},{"$f":"IF(O9=0, 0,IF(H9=\"\",IF(OR(AND($F8<=0.541,$G8=1,$F8>=0.5), AND($F8<=0.375,$G8=1)),0, IF($G8=1,O9-HLOOKUP($B6+$J8,RLT!$J$1:$X$10,4), IF(AND($F8<=0.0833,$G8=2), O9-HLOOKUP($B6+$J8,RLT!$J$1:$X$10,4), IF(AND($F8<=0.2916,$G8=2),O9-HLOOKUP($B6+$J8,RLT!$J$1:$X$10,7),IF(AND($F8<=0.541,$F8>=0.5,$G8=2),O9-HLOOKUP($B6+$J8,RLT!$J$1:$X$10,4), O9)))) ),O9))","v":0},{"$f":"SUMPRODUCT(--(I10:O10>0),I10:O10)","v":0},null,{"$f":"$B$7","v":0},null,{"$f":"IF($B$7=0, 0, VLOOKUP($B$7,RLT!$A$26:$E$294,2))","v":0},{"$f":"IF($B$7=0, 0, VLOOKUP($B$7,RLT!$A$26:$E$294,3))","v":0},{"$f":"IF($B$7=0, 0, VLOOKUP($B$7,RLT!$A$26:$E$294,4))","v":0},{"$f":"IF($B$7=0, 0, VLOOKUP($B$7,RLT!$A$26:$E$294,5))","v":0}]
[{"$f":"SUM(I10:I11)","v":0},0,0,0,0,0,0,null,{"$f":"IF(A10=9,0,IF(A9=\"\",0,IF(AND($B$6>1,$B$6<8),HLOOKUP($B$6,RLT!$B$1:$H$7,6),IF($B$6=8,$W$10,0))))","v":0},{"$f":"IF(B10=9,0,IF(B9=\"\",0,IF(AND($B$6>1,$B$6<8),HLOOKUP($B$6,RLT!$B$1:$H$7,6),IF($B$6=8,$W$10,0))))","v":0},{"$f":"IF(C10=9,0,IF(C9=\"\",0,IF(AND($B$6>1,$B$6<8),HLOOKUP($B$6,RLT!$B$1:$H$7,6),IF($B$6=8,$W$10,0))))","v":0},{"$f":"IF(D10=9,0,IF(D9=\"\",0,IF(AND($B$6>1,$B$6<8),HLOOKUP($B$6,RLT!$B$1:$H$7,6),IF($B$6=8,$W$10,0))))","v":0},{"$f":"IF(E10=9,0,IF(E9=\"\",0,IF(AND($B$6>1,$B$6<8),HLOOKUP($B$6,RLT!$B$1:$H$7,6),IF($B$6=8,$W$10,0))))","v":0},{"$f":"IF(F10=9,0,IF(F9=\"\",0,IF(AND($B$6>1,$B$6<8),HLOOKUP($B$6,RLT!$B$1:$H$7,6),IF($B$6=8,$W$10,0))))","v":0},{"$f":"IF(G10=9,0,IF(G9=\"\",0,IF(AND($B$6>1,$B$6<8),HLOOKUP($B$6,RLT!$B$1:$H$7,6),IF($B$6=8,$W$10,0))))","v":0},{"$f":"SUM(I11:O11)","v":0}]
[]
["Per Diem #2",null,"Location:",null,null,"Location 2 Total",{"$f":"SUM(A19:G19)","v":0}]
["Select Rates:",1,null,"Date",null,"Time"]
["Foreign Rates:",null,"Depart:",null,null,null,1]
{"$rows_left_out":37}
{"sheet":"Mileage Log","index":3,"n_rows":39,"n_cols":12,"rows_kept":39,"cut":false,"hidden":false,"merged":[[4,1,5,1],[4,2,5,2],[4,3,5,3],[0,2,0,3],[1,2,1,3],[3,2,3,3],[2,2,2,3],[0,5,0,10],[1,5,1,10],[0,11,5,13],[4,4,5,4],[4,6,5,6],[4,5,5,5],[4,7,4,8],[4,10,5,10],[2,5,2,10],[3,5,3,10]]}
[null,"Traveler Name",{"$f":"IF('Travel Reimbursement'!$B$1 = \"\",\"\",'Travel Reimbursement'!$B$1)","v":""},null,"Travel Start Date",{"$f":"IF('Travel Reimbursement'!$B$4=\"\",\"\",'Travel Reimbursement'!$B$4)","v":""},null,null,null,null,null,"Incomplete mileage logs may result in delays, adjustments, and disapprovals. All calculations for commuting mile deduction are automatically calculated when completing the mileage log."]
[null,"One Way Commute",null,null,"Travel End Date",{"$f":"IF('Travel Reimbursement'!$H$4=\"\",\"\",'Travel Reimbursement'!$H$4)","v":""}]
[null,"Official Duty Station",{"$f":"VLOOKUP('Travel Reimbursement'!$H$3,intake!B2:C13,2)","v":"SELECT DUTY STATION"},null,"Home Address"]
[null,"Total Mileage",{"$f":"SUM(L7:L39)","v":0},null,"Reimburseable Miles",{"$f":"SUM(K7:K39)","v":0}]
[null,"Date","From (City/State)","To (City/State)","Business\nPurpose","Entered\nMileage","Did you Depart/Return from/to your Official Duty Station?","Odometer",null,null,"Calculated\nMileage"]
[null,null,null,null,null,null,null,"Start","Finish","Round Trip"]
[null,null,null,null,null,0,"No",null,null,"No",{"$f":"IF(OR($C$2=\"\",$F$3=\"\",B7=\"\",C7=\"\",D7=\"\",E7=\"\"),0,(IF(F7>0,IF(G7=\"NO\",IF(J7=\"YES\",IF((F7*2-$C$2*2)>0,F7*2-$C$2*2,0),IF((F7-$C$2)>0,F7-$C$2,0)),IF(J7=\"YES\",F7*2,F7)),0)))","v":0},{"$f":"IF(J7=\"YES\",F7*2,F7)","v":0}]
[null,null,null,null,null,0,"No",null,null,"No",{"$f":"IF(OR($C$2=\"\",$F$3=\"\",B8=\"\",C8=\"\",D8=\"\",E8=\"\"),0,(IF(F8>0,IF(G8=\"NO\",IF(J8=\"YES\",IF((F8*2-$C$2*2)>0,F8*2-$C$2*2,0),IF((F8-$C$2)>0,F8-$C$2,0)),IF(J8=\"YES\",F8*2,F8)),0)))","v":0},{"$f":"IF(J8=\"YES\",F8*2,F8)","v":0}]
[null,null,null,null,null,0,"No",null,null,"No",0,0]
[null,null,null,null,null,0,"No",null,null,"No",0,0]
[null,null,null,null,null,0,"No",null,null,"No",0,0]
[null,null,null,null,null,0,"No",null,null,"No",0,0]
[null,null,null,null,null,0,"No",null,null,"No",0,0]
[null,null,null,null,null,0,"No",null,null,"No",0,0]
[null,null,null,null,null,0,"No",null,null,"No",0,0]
{"$rows_left_out":25}
{"sheet":"Business Meal Details","index":4,"n_rows":38,"n_cols":7,"rows_kept":38,"cut":false,"hidden":false,"merged":[[34,0,34,1],[34,3,37,6],[37,0,37,1],[0,0,0,6],[33,0,33,5],[1,0,1,1],[1,4,1,6],[35,0,35,1],[36,0,36,1]]}
["Business Meal Form"]
["Employee Name",null,{"$f":"IF('Travel Reimbursement'!B1=\"\",\"\",'Travel Reimbursement'!B1)","v":""},"Department",{"$f":"IF('Travel Reimbursement'!H1=0,\"\",'Travel Reimbursement'!H1)","v":""}]
["Meal Date","Location Name ","Business Purpose","Attendee Last Name","Attendee First Name","Attendee Affiliation","Total Cost"]
[null,null,null,null,null,null,0]
[null,null,null,null,null,null,0]
[null,null,null,null,null,null,0]
[null,null,null,null,null,null,0]
[null,null,null,null,null,null,0]
[null,null,null,null,null,null,0]
[null,null,null,null,null,null,0]
[null,null,null,null,null,null,0]
[null,null,null,null,null,null,0]
[null,null,null,null,null,null,0]
[null,null,null,null,null,null,0]
[null,null,null,null,null,null,0]
{"$rows_left_out":24}
{"sheet":"Meals With No Overnight","index":5,"n_rows":22,"n_cols":8,"rows_kept":22,"cut":false,"hidden":false,"merged":[[0,0,0,7],[17,0,17,1],[20,0,21,1],[20,2,21,2],[21,3,21,7],[17,3,19,7],[19,0,19,1],[1,0,1,1],[1,3,1,4],[1,5,1,6],[16,0,16,6],[18,0,18,1],[20,5,20,7],[20,3,20,4]]}
["Meal Reimbursement With No Overnight Stay"]
["Employee Name:",null,{"$f":"IF('Travel Reimbursement'!B1=\"\",\"\",'Travel Reimbursement'!B1)","v":""},"Official Duty Station:",null,{"$f":"VLOOKUP('Travel Reimbursement'!$H$3,intake!B2:C13,2)","v":"SELECT DUTY STATION"}]
["Meal Date","Location Name ","Business Purpose","Time Left Home/Duty Station","Time Returned to Home/Duty Station","Per diem Amount for Destination per Meal Claimed\nClick here to obtain Meal Rates","Select Meal For Reimbursment\nBreakfast / Lunch / Dinner ","Total Claimed - 75% of per diem amount"]
[null,null,null,null,null,null,null,{"$f":"IF(OR(F4=\"\",G4=\"\"),0,0.75*(INDEX(RLT!$B$3:$G$5,MATCH(G4,RLT!$A$3:$A$5,0),MATCH(F4,RLT!$B$2:$G$2,))))","v":0}]
[null,null,null,null,null,null,null,{"$f":"IF(OR(F5=\"\",G5=\"\"),0,0.75*(INDEX(RLT!$B$3:$G$5,MATCH(G5,RLT!$A$3:$A$5,0),MATCH(F5,RLT!$B$2:$G$2,))))","v":0}]
[null,null,null,null,null,null,null,{"$f":"IF(OR(F6=\"\",G6=\"\"),0,0.75*(INDEX(RLT!$B$3:$G$5,MATCH(G6,RLT!$A$3:$A$5,0),MATCH(F6,RLT!$B$2:$G$2,))))","v":0}]
[null,null,null,null,null,null,null,{"$f":"IF(OR(F7=\"\",G7=\"\"),0,0.75*(INDEX(RLT!$B$3:$G$5,MATCH(G7,RLT!$A$3:$A$5,0),MATCH(F7,RLT!$B$2:$G$2,))))","v":0}]
[null,null,null,null,null,null,null,{"$f":"IF(OR(F8=\"\",G8=\"\"),0,0.75*(INDEX(RLT!$B$3:$G$5,MATCH(G8,RLT!$A$3:$A$5,0),MATCH(F8,RLT!$B$2:$G$2,))))","v":0}]
[null,null,null,null,null,null,null,{"$f":"IF(OR(F9=\"\",G9=\"\"),0,0.75*(INDEX(RLT!$B$3:$G$5,MATCH(G9,RLT!$A$3:$A$5,0),MATCH(F9,RLT!$B$2:$G$2,))))","v":0}]
[null,null,null,null,null,null,null,{"$f":"IF(OR(F10=\"\",G10=\"\"),0,0.75*(INDEX(RLT!$B$3:$G$5,MATCH(G10,RLT!$A$3:$A$5,0),MATCH(F10,RLT!$B$2:$G$2,))))","v":0}]
[null,null,null,null,null,null,null,{"$f":"IF(OR(F11=\"\",G11=\"\"),0,0.75*(INDEX(RLT!$B$3:$G$5,MATCH(G11,RLT!$A$3:$A$5,0),MATCH(F11,RLT!$B$2:$G$2,))))","v":0}]
[null,null,null,null,null,null,null,{"$f":"IF(OR(F12=\"\",G12=\"\"),0,0.75*(INDEX(RLT!$B$3:$G$5,MATCH(G12,RLT!$A$3:$A$5,0),MATCH(F12,RLT!$B$2:$G$2,))))","v":0}]
[null,null,null,null,null,null,null,{"$f":"IF(OR(F13=\"\",G13=\"\"),0,0.75*(INDEX(RLT!$B$3:$G$5,MATCH(G13,RLT!$A$3:$A$5,0),MATCH(F13,RLT!$B$2:$G$2,))))","v":0}]
[null,null,null,null,null,null,null,{"$f":"IF(OR(F14=\"\",G14=\"\"),0,0.75*(INDEX(RLT!$B$3:$G$5,MATCH(G14,RLT!$A$3:$A$5,0),MATCH(F14,RLT!$B$2:$G$2,))))","v":0}]
[null,null,null,null,null,null,null,{"$f":"IF(OR(F15=\"\",G15=\"\"),0,0.75*(INDEX(RLT!$B$3:$G$5,MATCH(G15,RLT!$A$3:$A$5,0),MATCH(F15,RLT!$B$2:$G$2,))))","v":0}]
{"$rows_left_out":8}
{"sheet":"RLT","index":6,"n_rows":294,"n_cols":24,"rows_kept":294,"cut":false,"hidden":true,"merged":[[8,0,8,3],[17,0,17,4]]}
[1,2,3,4,5,6,7,8,null,1,2,3,4,5,6,7,8,9,10,11,12,13,14,15]
["M&IE Total",46,51,56,61,66,71,{"$f":"SUM('Travel Reimbursement'!$T$3,'Travel Reimbursement'!$U$3,'Travel Reimbursement'!$V$3,'Travel Reimbursement'!$W$3)","v":0},null,"M&IE Total",{"$f":"B2","v":46},{"$f":"C2","v":51},56,61,66,71,0,{"$f":"R22","v":0},{"$f":"S22","v":0},0,0,0,0,0]
["Breakfast",7,8,9,10,11,12,{"$f":"'Travel Reimbursement'!$T$3","v":0},1,"None",{"$f":"K2-B6","v":41},46,51,56,61,66,0,{"$f":"R2-R26","v":0},0,0,0,0,0,0]
["Lunch",11,12,13,15,16,18,{"$f":"'Travel Reimbursement'!$U$3","v":0},2,"Breakfast only",{"$f":"K3-B3","v":34},38,42,46,50,54,0,{"$f":"R3-R23","v":0},0,0,0,0,0,0]
["Dinner",23,26,29,31,34,36,{"$f":"'Travel Reimbursement'!$V$3","v":0},3,"Lunch only",{"$f":"K3-B4","v":30},34,38,41,45,48,0,{"$f":"R3-R24","v":0},0,0,0,0,0,0]
["Incidentals",5,5,5,5,5,5,{"$f":"'Travel Reimbursement'!$W$3","v":0},4,"Dinner Only",{"$f":"K3-B5","v":18},20,22,25,27,30,0,{"$f":"R3-R25","v":0},0,0,0,0,0,0]
[null,null,null,null,null,null,null,null,5,"Breakfast and Lunch",{"$f":"K3-B3-B4","v":23},26,29,31,34,36,0,{"$f":"R3-R23-R24","v":0},0,0,0,0,0,0]
[null,null,null,null,null,null,null,null,6,"Breakfast and Dinner",{"$f":"K3-B3-B5","v":11},12,13,15,16,18,0,{"$f":"R3-R23-R25","v":0},0,0,0,0,0,0]
["Mileage Table",null,null,null,null,null,null,null,7,"Lunch and Dinner",{"$f":"K3-B4-B5","v":7},8,9,10,11,12,0,{"$f":"R3-R24-R25","v":0},0,0,0,0,0,0]
[null,"Prior","Previous","Current",null,null,null,null,8,"Bfast Lunch and Dinner",0,0,0,0,0,0,0,0,0,0,0,0,0,0]
[null,0.56499999999999995,0.56000000000000005,0.57499999999999996,null,null,null,null,9,"Personal Day",0,0,0,0,0,0,0,0,0,0,0,0,0,0]
["effective date","2013-01-29","2014-01-01","2015-01-28",null,null,null,null,10,"Did not Partake-Dietary",{"$f":"K2-B6","v":41},46,51,56,61,66,0,{"$f":"R2-R26","v":0},0,0,0,0,0,0]
[{"$f":"IF('Travel Reimbursement'!B4 = \"\", TODAY(),'Travel Reimbursement'!B4)","v":"2015-03-24"},null,null,null,null,null,null,null,11,"Did not partake-Religious",{"$f":"K2-B6","v":41},46,51,56,61,66,0,{"$f":"R2-R26","v":0},0,0,0,0,0,0]
[null,null,null,null,null,null,null,null,12,"Did not partake-Business",{"$f":"K2-B6","v":41},46,51,56,61,66,0,{"$f":"R2-R26","v":0},0,0,0,0,0,0]
[null,null,null,false]
{"$rows_left_out":279}